{"text_format":"1","workbook":"xlsx","n_sheets":17,"sheets":["Erläuterung","1. Katalog Kompetenzen I","1. Katalog Kompetenzen II","1. Katalog Kompetenzen III","1. Katalog Kompetenzen IV","1. Katalog Kompetenzen V","1. Katalog Kompetenzen VI","2. Anforderungsprofil","3. Selbstbeurteilung","4. Fremdbeurteilung I","4. Fremdbeurteilung II","4. Fremdbeurteilung III","4. Fremdbeurteilung IV","5. Ergebnisdiagramme I","5. Ergebnisdiagramme II","Tabelle1","6. Maßnahmenübersicht"],"not_rendered":{"charts":8,"images":2,"macros":1,"external_links":0,"defined_names":22,"comments":16,"pivot_tables":0},"unopened":[],"bounds":{"document_bytes":16777216,"sheet_cells":100000,"rows_first":2000,"rows_last":500,"rows_between":2000,"halvings":0,"cell_chars":16384,"cell_head_chars":4096},"cells_cut":0,"cells_raw":0,"read":"whole","date_system":"1900"}

{"sheet":"Erläuterung","index":0,"n_rows":0,"n_cols":0,"rows_kept":0,"cut":false,"hidden":false,"merged":[]}

{"sheet":"1. Katalog Kompetenzen I","index":1,"n_rows":12,"n_cols":7,"rows_kept":12,"cut":false,"hidden":false,"merged":[[12,1,12,5],[1,1,1,6],[4,1,11,1]]}
[]
[null,"1. Katalog Führungskompetenzen I"]
[]
[null,null,"Nr.","Kompetenz","geringe Ausprägung der Kompetenz","Beispielhafte Verhaltensmerkmale","Wichtig für die Position"]
[null,"Persönliche Kompetenzen",1,"Fähigkeit, überzeugend aufzutreten","nervöses Verhalten, stockende Sprache","positive Körperhaltung; flüssige Sprache; unterstützende Gestik und Mimik beim Sprechen",false]
[null,null,{"$f":"C5+1","v":2},"Fähigkeit, durch Vertrauen tragfähige Beziehungen aufzubauen","übertriebenes Überprüfen und Kontrollieren","Transparenz durch gemeinsame Betrachtung von Ergebnissen; Verschwiegenheit",false]
[null,null,{"$f":"C6+1","v":3},"Fähigkeit, mit eigenen Gefühlen konstruktiv umzugehen","Gefühlsausbrüche in der Öffentlichkeit","Selbst- und Emotionskontrolle (auch in kritischen Situationen); ausgeglichenes Wesen",false]
[null,null,4,"Fähigkeit, sich in das Erleben anderer hineinzuversetzen","Verständnislosigkeit für Emotionen anderer","Widergeben der Emotionen anderer in eigenen Worten; Empathievermögen",false]
[null,null,5,"Fähigkeit, sich selbst zu reflektieren und Einsicht zu zeigen","Abwehr von Kritik und Meinungen anderer","Offenheit für Kritik; Hinterfragen von Kritik; Eingestehen von Fehlern",false]
[null,null,6,null,null,null,false]
{"$rows_left_out":3}
{"sheet":"1. Katalog Kompetenzen II","index":2,"n_rows":12,"n_cols":7,"rows_kept":12,"cut":false,"hidden":false,"merged":[[12,1,12,5],[1,1,1,6],[4,1,11,1]]}
[]
[null,"1. Katalog Führungskompetenzen II"]
[]
[null,null,"Nr.","Kompetenz","geringe Ausprägung der Kompetenz","Beispielhafte Verhaltensmerkmale","Wichtig für die Position"]
[null,"Kommunikative Kompetenzen",1,"Fähigkeit, mit anderen effektiv und effizient zu kommunizieren","Kommunikationsziel unklar, kaum Medienkompetenz","erkennbare Struktur, klar nachvollziehbare Kommunikationsziele, Medienkompetenzen, kaum erforderliche Nachfragen",false]
[null,null,{"$f":"C5+1","v":2},"Fähigkeit, Teams effektiv und effizient zu leiten","Steuerung Einzelner, fehlender Zusammenhalt","Fördern von Zusammenhalt und Zielfokussierung u. a. durch Teambesprechungen oder Teamziele",false]
[null,null,{"$f":"C6+1","v":3},"Fähigkeit, Aufgaben an andere zu delegieren","kaum Aufgabendelegation","systematische Übertragung von Aufgaben an andere",false]
[null,null,4,"Fähigkeit, Entscheidungen und Prozesse nachvollziehbar zu kommunizieren","unpassende Sprache, fehlender roter Faden ","Wahl angemessener Sprache; Argumente und Abbildungen; Argumentationslogik; Mitdenken von Gegenargumenten",false]
[null,null,5,"Fähigkeit, persönliche Netzwerke aufzubauen und aufrecht zu erhalten","kaum Vernetzung mit Personen/Gruppen","intensive Vernetzung mit Personen/Gruppen; Teilnahme an Veranstaltungen; digitale Kontakte über Netzwerke",false]
[null,null,6,null,null,null,false]
{"$rows_left_out":3}
{"sheet":"1. Katalog Kompetenzen III","index":3,"n_rows":12,"n_cols":7,"rows_kept":12,"cut":false,"hidden":false,"merged":[[12,1,12,5],[1,1,1,6],[4,1,11,1]]}
[]
[null,"1. Katalog Führungskompetenzen III"]
[]
[null,null,"Nr.","Kompetenz","geringe Ausprägung der Kompetenz","Beispielhafte Verhaltensmerkmale","Wichtig für die Position"]
[null,"Unternehmerische Kompetenzen",1,"Fähigkeit, Pläne und Abläufe zu entwickeln","kaum systematische Arbeitsplanung  ","Ableitung von Schrittfolgen zur Aufgabenerfüllung; Untersetzung mit einer Zeit- und Meilensteinplanung",false]
[null,null,{"$f":"C5+1","v":2},"Fähigkeit, Neuerungen in Prozesse und Strukturen zu integrieren","Beharren auf Bisherigem, Abwehr von Neuem","Offenheit für Neues; Integration von Neuem z. B. über Ableitung von Pilotvorhaben/-bereichen oder Testphasen",false]
[null,null,{"$f":"C6+1","v":3},"Fähigkeit, wirtschaftlich und strategisch zu denken","kurzfristige Fokussierung auf eigene Ziele","mittelfristige Orientierung an Unternehmenszielen; Abwägung von Kosten und Nutzen bei Entscheidungen",false]
[null,null,4,"Fähigkeit, für kontinuierliche Verbesserungen zu sorgen","Desinteresse an Vorschlägen der Mitarbeitenden","aktive Motivation der Mitarbeitenden; Kommunikation und Würdigung wertvoller Vorschläge; Feedback zu Umsetzungsständen",false]
[null,null,5,"Fähigkeit, Risiken abzuschätzen und einzugehen","Negieren potenzieller Risiken","Sammlung und Bewertung von Risiken; Einholen von Expertenwissen; um Risiken fundiert einschätzen zu können",false]
[null,null,6,null,null,null,false]
{"$rows_left_out":3}
{"sheet":"1. Katalog Kompetenzen IV","index":4,"n_rows":12,"n_cols":7,"rows_kept":12,"cut":false,"hidden":false,"merged":[[1,1,1,6],[4,1,11,1],[12,1,12,5]]}
[]
[null,"1. Katalog Führungskompetenzen IV"]
[]
[null,null,"Nr.","Kompetenz","geringe Ausprägung der Kompetenz","Beispielhafte Verhaltensmerkmale","Wichtig für die Position"]
[null,"Kompetenzen, um Lernfähigkeit und Veränderungsbereitschaft zu fördern",1,"Fähigkeit, individuelle Stärken zu erkennen und zu fördern","kaum persönliche Gespräche, kaum Personalentwicklung","Führen persönlicher Gespräche mit Beschäftigten und Ableitung von Folgemaßnahmen; Überprüfung der Vereinbarungen",false]
[null,null,{"$f":"C5+1","v":2},"Fähigkeit, ehrliches und hilfreiches Feedback zu geben","kaum Beachtung von Feedbackregeln","Beachtung von Feedbackregeln; Lob für Erfolge; konstruktive und konkrete Vorschläge für eine positive Veränderung",false]
[null,null,{"$f":"C6+1","v":3},"Fähigkeit, Selbstständigkeit anderer zu fördern","Kontrolle statt Vertrauen","Vertrauen statt Kontrolle; Übergabe verantwortungsvoller Aufgaben mit Möglichkeit Hilfe zu erbitten; Mentorenrolle",false]
[null,null,4,"Fähigkeit, mit Problemen positiv umzugehen","Betrachtung von Problemen als Risiko","Betrachtung von Problemen als Chance; Analyse der Ursachen von Problemen; Erarbeitung von Maßnahmen zur Ursachenvermeidung",false]
[null,null,5,"Fähigkeit, Konflikte frühzeitig zu erkennen und konstruktiv zu bewältigen","wenig Sensitivität, Konfliktvermeidung","hohe Sensitivität; Mut, mit Konflikten umzugehen; Logik beim Führen von Konfliktgesprächen; Neutralität bei Konfliktmoderation",false]
[null,null,6,null,null,null,false]
{"$rows_left_out":3}
{"sheet":"1. Katalog Kompetenzen V","index":5,"n_rows":12,"n_cols":7,"rows_kept":12,"cut":false,"hidden":false,"merged":[[1,1,1,6],[4,1,11,1],[12,1,12,5]]}
[]
[null,"1. Katalog Führungskompetenzen V"]
[]
[null,null,"Nr.","Kompetenz","geringe Ausprägung der Kompetenz","Beispielhafte Verhaltensmerkmale","Wichtig für die Position"]
[null,"Kompetenzen, um Ergebnisse zu sichern",1,"Fähigkeit, Verantwortung für Aufgaben und Prozesse zu übernehmen","geringe Orientierung auf Ergebnisse und ihre Folgen","Bewusstsein über Handlungsalternativen und deren mögliche Folgen; Monitoring wesentlicher Kennzahlen bzgl. der Aufgaben und Prozesse",false]
[null,null,{"$f":"C5+1","v":2},"Fähigkeit, Entscheidungen zeitnah und konsequent zu treffen","Angst vor falschen Entscheidungen","strukturierte Entscheidungsvorbereitung; Mut, Entscheidungen zu treffen; nachvollziehbare Begründung der Entscheidungen",false]
[null,null,{"$f":"C6+1","v":3},"Fähigkeit, interne und externe Verhandlungen wirtschaftlich zu führen","stures Beharren, wenig Flexibilität","Klarheit über Verhandlungsziel und den möglichen Verhandlungsspielraum; Kompromissbereitschaft",false]
[null,null,4,"Fähigkeit, Leistungen ergebnisorientiert zu bewerten","Angst, zu beurteilen, subjektive Beurteilungen","Beurteilung entlang objektivierter und beschriebener Kriterien; Bekanntmachung der Kriterien; Bezug zu konkreten Leistungen und Beispielen",false]
[null,null,5,"Fähigkeit, Kundenerwartungen in eigene Prozesse zu integrieren","beschränkte Perspektive auf interne Prozesse","Aktive Nachfrage bei Kunden; kritische Auseinandersetzung mit Kundenerfahrungen; Ableitung von Veränderungsbedarfen und Maßnahmen",false]
[null,null,6,null,null,null,false]
{"$rows_left_out":3}
{"sheet":"1. Katalog Kompetenzen VI","index":6,"n_rows":12,"n_cols":7,"rows_kept":12,"cut":false,"hidden":false,"merged":[[1,1,1,6],[4,1,11,1],[12,1,12,5]]}
[]
[null,"1. Katalog Führungskompetenzen VI"]
[]
[null,null,"Nr.","Kompetenz","geringe Ausprägung der Kompetenz","Beispielhafte Verhaltensmerkmale","Wichtig für die Position"]
[null,"Kompetenzen, um Ziele und Perspektiven zu entwickeln",1,"Fähigkeit, eine (Zukunfts-) Vision zu entwickeln und zu vermitteln","Fokussierung auf Gegenwart, wenig Kreativität","Aktive Auseinandersetzung mit Trends, Entwicklung verschiedener Szenarien, Formulierung eines realistischen Entwicklungswunsches",false]
[null,null,{"$f":"C5+1","v":2},"Fähigkeit, die Unternehmensvision vorzuleben","kaum Einbindung Zukunftsbild in aktuelles Geschehen","Bezüge zum Zukunftsbild herstellen; Unternehmensstrategie vorleben; aktuelle Maßnahmen in Bezug zum Zukunftsbild setzen",false]
[null,null,{"$f":"C6+1","v":3},"Fähigkeit, Prioritäten zu setzen und sich darauf zu konzentrieren","Arbeiten auf Zuruf, ohne Puffer, unter Zeitdruck","Abwägen von \"dringend\" und \"wichtig\" gelingt gut; Kriterien zu Priorisierung sind transparent und bekannt",false]
[null,null,4,"Fähigkeit, angemessene Ziele zu setzen","Ziele sind unrealistisch oder unpräzise, keine Ziele","Ziele sind SMART formuliert, d. h. spezifisch, messbar, attraktiv, realistisch und terminiert",false]
[null,null,5,"Fähigkeit, konkrete Maßnahmen zu formulieren","keine Maßnahmen, missverständliche Formulierung","verständliche Formulierung von Aufträgen, die umgehend in die Umsetzung gehen können; hohe Handlungsorientierung",false]
[null,null,6,null,null,null,false]
{"$rows_left_out":3}
{"sheet":"2. Anforderungsprofil","index":7,"n_rows":35,"n_cols":7,"rows_kept":35,"cut":false,"hidden":false,"merged":[[1,1,1,5],[31,1,33,1],[7,2,8,2],[7,5,8,5],[7,6,8,6],[7,1,8,1],[27,1,29,1],[9,1,11,1],[13,1,15,1],[19,1,21,1],[23,1,25,1],[3,1,3,2],[12,5,12,6],[16,5,16,6],[22,5,22,6],[7,3,8,3],[7,4,8,4],[26,5,26,6],[30,5,30,6],[34,5,34,6]]}
[]
[null,"2. Anforderungsprofil"]
[]
[null,"Anforderungsprofil zur Position:"]
[]
[null,null,"vom (Datum):"]
[]
[null,null,"Kompetenz","geringe Ausprägung der Kompetenz","Beispielhafte Verhaltensmerkmale","Gewichtung","Schwellen-wert \n(max. pro Kategorie: 4)"]
[]
[null,"Persönliche Kompetenzen",{"$f":"IF(ROW(C1)>COUNTIF('1. Katalog Kompetenzen I'!G:G,TRUE),\"\",INDEX('1. Katalog Kompetenzen I'!D:D,SMALL(IF('1. Katalog Kompetenzen I'!G:G=TRUE,ROW($1:$112)),ROW(C1))))","v":""},{"$f":"IF(ROW(D1)>COUNTIF('1. Katalog Kompetenzen I'!$G:$G,TRUE),\"\",INDEX('1. Katalog Kompetenzen I'!E:E,SMALL(IF('1. Katalog Kompetenzen I'!$G:$G=TRUE,ROW($1:$112)),ROW(D1))))","v":""},{"$f":"IF(ROW(E1)>COUNTIF('1. Katalog Kompetenzen I'!$G:$G,TRUE),\"\",INDEX('1. Katalog Kompetenzen I'!F:F,SMALL(IF('1. Katalog Kompetenzen I'!$G:$G=TRUE,ROW($1:$112)),ROW(E1))))","v":""}]
{"$rows_left_out":26}
{"sheet":"3. Selbstbeurteilung","index":8,"n_rows":29,"n_cols":9,"rows_kept":29,"cut":false,"hidden":false,"merged":[[1,1,1,4],[8,1,9,1],[8,2,9,2],[8,5,9,5],[8,3,9,3],[8,4,9,4],[3,1,3,2],[3,6,3,7],[10,7,12,7],[8,7,9,7],[26,1,28,1],[26,7,28,7],[23,7,25,7],[20,7,22,7],[17,7,19,7],[13,7,15,7],[17,1,19,1],[20,1,22,1],[23,1,25,1],[10,1,12,1],[13,1,15,1],[8,6,9,6]]}
[]
[null,"3. Selbstbeurteilung"]
[]
[]
[null,null,"Selbstbeurteilung von:"]
[]
[null,null,"vom (Datum):"]
[]
[null,null,"Kompetenz","geringe Ausprägung der Kompetenz","Beispielhafte Verhaltensmerkmale","Gewichtung","Häufigkeit","Gesamtwert in  Kategorie"]
[]
{"$rows_left_out":20}
{"sheet":"4. Fremdbeurteilung I","index":9,"n_rows":32,"n_cols":9,"rows_kept":32,"cut":false,"hidden":false,"merged":[[26,7,28,7],[10,3,11,3],[10,4,11,4],[10,6,11,6],[1,1,1,5],[29,7,31,7],[10,2,11,2],[10,1,11,1],[10,5,11,5],[10,7,11,7],[12,1,14,1],[15,1,17,1],[20,1,22,1],[23,1,25,1],[26,1,28,1],[29,1,31,1],[12,7,14,7],[15,7,17,7],[20,7,22,7],[23,7,25,7]]}
[]
[null,"4. Fremdbeurteilung I"]
[]
[]
[null,null,"Fremdbeurteilung von:"]
[]
[null,null,"*Beurteilung durch:"]
[]
[null,null,"vom (Datum):"]
[]
{"$rows_left_out":23}
{"sheet":"4. Fremdbeurteilung II","index":10,"n_rows":32,"n_cols":9,"rows_kept":32,"cut":false,"hidden":false,"merged":[[1,1,1,5],[10,1,11,1],[10,2,11,2],[10,3,11,3],[10,4,11,4],[10,5,11,5],[10,6,11,6],[10,7,11,7],[12,1,14,1],[12,7,14,7],[15,1,17,1],[15,7,17,7],[29,1,31,1],[29,7,31,7],[20,1,22,1],[20,7,22,7],[23,1,25,1],[23,7,25,7],[26,1,28,1],[26,7,28,7]]}
[]
[null,"4. Fremdbeurteilung II"]
[]
[]
[null,null,"Fremdbeurteilung von:",null,{"$f":"'3. Selbstbeurteilung'!E5","v":0}]
[]
[null,null,"*Beurteilung durch:"]
[]
[null,null,"vom (Datum):"]
[]
{"$rows_left_out":23}
{"sheet":"4. Fremdbeurteilung III","index":11,"n_rows":32,"n_cols":9,"rows_kept":32,"cut":false,"hidden":false,"merged":[[1,1,1,5],[10,1,11,1],[10,2,11,2],[10,3,11,3],[10,4,11,4],[10,5,11,5],[10,6,11,6],[10,7,11,7],[12,1,14,1],[12,7,14,7],[15,1,17,1],[15,7,17,7],[29,1,31,1],[29,7,31,7],[20,1,22,1],[20,7,22,7],[23,1,25,1],[23,7,25,7],[26,1,28,1],[26,7,28,7]]}
[]
[null,"4. Fremdbeurteilung III"]
[]
[]
[null,null,"Fremdbeurteilung von:",null,{"$f":"'3. Selbstbeurteilung'!E5","v":0}]
[]
[null,null,"*Beurteilung durch:"]
[]
[null,null,"vom (Datum):"]
[]
{"$rows_left_out":23}
{"sheet":"4. Fremdbeurteilung IV","index":12,"n_rows":32,"n_cols":9,"rows_kept":32,"cut":false,"hidden":false,"merged":[[1,1,1,5],[10,1,11,1],[10,2,11,2],[10,3,11,3],[10,4,11,4],[10,5,11,5],[10,6,11,6],[10,7,11,7],[12,1,14,1],[12,7,14,7],[15,1,17,1],[15,7,17,7],[29,1,31,1],[29,7,31,7],[20,1,22,1],[20,7,22,7],[23,1,25,1],[23,7,25,7],[26,1,28,1],[26,7,28,7]]}
[]
[null,"4. Fremdbeurteilung IV"]
[]
[]
[null,null,"Fremdbeurteilung von:",null,{"$f":"'3. Selbstbeurteilung'!E5","v":0}]
[]
[null,null,"*Beurteilung durch:"]
[]
[null,null,"vom (Datum):"]
[]
{"$rows_left_out":23}
{"sheet":"5. Ergebnisdiagramme I","index":13,"n_rows":65,"n_cols":9,"rows_kept":65,"cut":false,"hidden":false,"merged":[[65,1,65,5],[31,1,31,2],[33,1,33,2],[38,1,38,5],[39,1,39,5],[51,1,51,5],[43,1,43,5],[44,1,44,5],[52,1,52,5],[64,1,64,5]]}
[null,null,"Schwellenwert","Fremdbeurteilung 1","Fremdbeurteilung 2","Fremdbeurteilung 3","Fremdbeurteilung 4","Selbstbeurteilung","Gesamtfremdbeurteilung"]
[null,{"$f":"'2. Anforderungsprofil'!B10","v":"Persönliche Kompetenzen"},{"$f":"'2. Anforderungsprofil'!G11","v":0},{"$f":"'4. Fremdbeurteilung I'!H13","v":0},{"$f":"'4. Fremdbeurteilung II'!H13","v":0},{"$f":"'4. Fremdbeurteilung III'!H13","v":0},{"$f":"'4. Fremdbeurteilung IV'!H13","v":0},{"$f":"'3. Selbstbeurteilung'!H11","v":0},{"$f":"AVERAGEIF(D2:G2,\">0\")","v":{"$error":"#DIV/0!"}}]
[null,{"$f":"'2. Anforderungsprofil'!B3","v":0},{"$f":"'2. Anforderungsprofil'!G3","v":0},{"$f":"'4. Fremdbeurteilung I'!I14","v":0},{"$f":"'4. Fremdbeurteilung II'!H14","v":0},{"$f":"'4. Fremdbeurteilung III'!H14","v":0},{"$f":"'4. Fremdbeurteilung IV'!H14","v":0},{"$f":"'3. Selbstbeurteilung'!H12","v":0},{"$f":"AVERAGEIF(D3:G3,\">0\")","v":{"$error":"#DIV/0!"}}]
[null,null,null,{"$f":"'4. Fremdbeurteilung I'!I15","v":0},{"$f":"'4. Fremdbeurteilung II'!H15","v":0},{"$f":"'4. Fremdbeurteilung III'!H15","v":0},{"$f":"'4. Fremdbeurteilung IV'!H15","v":0},{"$f":"'3. Selbstbeurteilung'!H13","v":0},{"$error":"#DIV/0!"}]
[null,{"$f":"'2. Anforderungsprofil'!B14","v":"Kommunikative Kompetenzen"},{"$f":"'2. Anforderungsprofil'!G15","v":0},{"$f":"'4. Fremdbeurteilung I'!H16","v":0},{"$f":"'4. Fremdbeurteilung II'!H16","v":0},{"$f":"'4. Fremdbeurteilung III'!H16","v":0},{"$f":"'4. Fremdbeurteilung IV'!H16","v":0},{"$f":"'3. Selbstbeurteilung'!H14","v":0},{"$error":"#DIV/0!"}]
[null,{"$f":"'2. Anforderungsprofil'!B15","v":0},null,{"$f":"'4. Fremdbeurteilung I'!H17","v":0},{"$f":"'4. Fremdbeurteilung II'!H17","v":0},{"$f":"'4. Fremdbeurteilung III'!H17","v":0},{"$f":"'4. Fremdbeurteilung IV'!H17","v":0},{"$f":"'3. Selbstbeurteilung'!H15","v":0},{"$error":"#DIV/0!"}]
[null,{"$f":"'2. Anforderungsprofil'!B16","v":0},{"$f":"'2. Anforderungsprofil'!G12","v":0},{"$f":"'4. Fremdbeurteilung I'!H18","v":0},{"$f":"'4. Fremdbeurteilung II'!H18","v":0},{"$f":"'4. Fremdbeurteilung III'!H18","v":0},{"$f":"'4. Fremdbeurteilung IV'!H18","v":0},{"$f":"'3. Selbstbeurteilung'!H16","v":0},{"$error":"#DIV/0!"}]
[null,{"$f":"'2. Anforderungsprofil'!B20","v":"Unternehmerische Kompetenzen"},{"$f":"'2. Anforderungsprofil'!G21","v":0},{"$f":"'4. Fremdbeurteilung I'!H21","v":0},{"$f":"'4. Fremdbeurteilung II'!H21","v":0},{"$f":"'4. Fremdbeurteilung III'!H21","v":0},{"$f":"'4. Fremdbeurteilung IV'!H21","v":0},{"$f":"'3. Selbstbeurteilung'!H18","v":0},{"$error":"#DIV/0!"}]
[null,{"$f":"'2. Anforderungsprofil'!B21","v":0},null,{"$f":"'4. Fremdbeurteilung I'!H22","v":0},{"$f":"'4. Fremdbeurteilung II'!H22","v":0},{"$f":"'4. Fremdbeurteilung III'!H22","v":0},{"$f":"'4. Fremdbeurteilung IV'!H22","v":0},{"$f":"'3. Selbstbeurteilung'!H19","v":0},{"$error":"#DIV/0!"}]
[null,{"$f":"'2. Anforderungsprofil'!B22","v":0},{"$f":"'2. Anforderungsprofil'!G16","v":0},{"$f":"'4. Fremdbeurteilung I'!H23","v":0},{"$f":"'4. Fremdbeurteilung II'!H23","v":0},{"$f":"'4. Fremdbeurteilung III'!H23","v":0},{"$f":"'4. Fremdbeurteilung IV'!H23","v":0},{"$f":"'3. Selbstbeurteilung'!H20","v":0},{"$error":"#DIV/0!"}]
{"$rows_left_out":56}
{"sheet":"5. Ergebnisdiagramme II","index":14,"n_rows":167,"n_cols":9,"rows_kept":167,"cut":false,"hidden":false,"merged":[[31,1,31,2],[33,1,33,2],[38,1,38,5],[39,1,39,5],[43,1,43,5],[44,1,44,5],[138,1,138,5],[139,1,139,5],[166,1,166,5],[167,1,167,5],[89,1,89,5],[90,1,90,5],[114,1,114,5],[115,1,115,5],[51,1,51,5],[52,1,52,5],[64,1,64,5],[65,1,65,5]]}
[null,null,"Schwellenwert","Fremdbeurteilung 1","Fremdbeurteilung 2","Fremdbeurteilung 3","Fremdbeurteilung 4","Selbstbeurteilung","Gesamtfremdbeurteilung"]
[null,{"$f":"'2. Anforderungsprofil'!B10","v":"Persönliche Kompetenzen"},{"$f":"'2. Anforderungsprofil'!G10","v":0},{"$f":"'4. Fremdbeurteilung I'!H13","v":0},{"$f":"'4. Fremdbeurteilung II'!H13","v":0},{"$f":"'4. Fremdbeurteilung III'!H13","v":0},{"$f":"'4. Fremdbeurteilung IV'!H13","v":0},{"$f":"'3. Selbstbeurteilung'!H11","v":0},{"$f":"AVERAGEIF(D2:G2,\">0\")","v":{"$error":"#DIV/0!"}}]
[null,{"$f":"'2. Anforderungsprofil'!B3","v":0},{"$f":"'2. Anforderungsprofil'!G3","v":0},{"$f":"'4. Fremdbeurteilung I'!I14","v":0},{"$f":"'4. Fremdbeurteilung II'!H14","v":0},{"$f":"'4. Fremdbeurteilung III'!H14","v":0},{"$f":"'4. Fremdbeurteilung IV'!H14","v":0},{"$f":"'3. Selbstbeurteilung'!H12","v":0},{"$f":"AVERAGEIF(D3:G3,\">0\")","v":{"$error":"#DIV/0!"}}]
[null,{"$f":"'2. Anforderungsprofil'!#REF!","v":{"$error":"#REF!"}},{"$f":"'2. Anforderungsprofil'!#REF!","v":{"$error":"#REF!"}},{"$f":"'4. Fremdbeurteilung I'!I15","v":0},{"$f":"'4. Fremdbeurteilung II'!H15","v":0},{"$f":"'4. Fremdbeurteilung III'!H15","v":0},{"$f":"'4. Fremdbeurteilung IV'!H15","v":0},{"$f":"'3. Selbstbeurteilung'!H13","v":0},{"$error":"#DIV/0!"}]
[null,{"$f":"'2. Anforderungsprofil'!B14","v":"Kommunikative Kompetenzen"},{"$f":"'2. Anforderungsprofil'!G14","v":0},{"$f":"'4. Fremdbeurteilung I'!H16","v":0},{"$f":"'4. Fremdbeurteilung II'!H16","v":0},{"$f":"'4. Fremdbeurteilung III'!H16","v":0},{"$f":"'4. Fremdbeurteilung IV'!H16","v":0},{"$f":"'3. Selbstbeurteilung'!H14","v":0},{"$error":"#DIV/0!"}]
[null,{"$f":"'2. Anforderungsprofil'!B15","v":0},{"$f":"'2. Anforderungsprofil'!G11","v":0},{"$f":"'4. Fremdbeurteilung I'!H17","v":0},{"$f":"'4. Fremdbeurteilung II'!H17","v":0},{"$f":"'4. Fremdbeurteilung III'!H17","v":0},{"$f":"'4. Fremdbeurteilung IV'!H17","v":0},{"$f":"'3. Selbstbeurteilung'!H15","v":0},{"$error":"#DIV/0!"}]
[null,{"$f":"'2. Anforderungsprofil'!B16","v":0},{"$f":"'2. Anforderungsprofil'!G12","v":0},{"$f":"'4. Fremdbeurteilung I'!H18","v":0},{"$f":"'4. Fremdbeurteilung II'!H18","v":0},{"$f":"'4. Fremdbeurteilung III'!H18","v":0},{"$f":"'4. Fremdbeurteilung IV'!H18","v":0},{"$f":"'3. Selbstbeurteilung'!H16","v":0},{"$error":"#DIV/0!"}]
[null,{"$f":"'2. Anforderungsprofil'!B20","v":"Unternehmerische Kompetenzen"},{"$f":"'2. Anforderungsprofil'!G20","v":0},{"$f":"'4. Fremdbeurteilung I'!H21","v":0},{"$f":"'4. Fremdbeurteilung II'!H21","v":0},{"$f":"'4. Fremdbeurteilung III'!H21","v":0},{"$f":"'4. Fremdbeurteilung IV'!H21","v":0},{"$f":"'3. Selbstbeurteilung'!H18","v":0},{"$error":"#DIV/0!"}]
[null,{"$f":"'2. Anforderungsprofil'!B21","v":0},{"$f":"'2. Anforderungsprofil'!G15","v":0},{"$f":"'4. Fremdbeurteilung I'!H22","v":0},{"$f":"'4. Fremdbeurteilung II'!H22","v":0},{"$f":"'4. Fremdbeurteilung III'!H22","v":0},{"$f":"'4. Fremdbeurteilung IV'!H22","v":0},{"$f":"'3. Selbstbeurteilung'!H19","v":0},{"$error":"#DIV/0!"}]
[null,{"$f":"'2. Anforderungsprofil'!B22","v":0},{"$f":"'2. Anforderungsprofil'!G16","v":0},{"$f":"'4. Fremdbeurteilung I'!H23","v":0},{"$f":"'4. Fremdbeurteilung II'!H23","v":0},{"$f":"'4. Fremdbeurteilung III'!H23","v":0},{"$f":"'4. Fremdbeurteilung IV'!H23","v":0},{"$f":"'3. Selbstbeurteilung'!H20","v":0},{"$error":"#DIV/0!"}]
{"$rows_left_out":158}
{"sheet":"Tabelle1","index":15,"n_rows":35,"n_cols":10,"rows_kept":35,"cut":false,"hidden":true,"merged":[[27,1,29,1],[3,1,3,2],[31,1,33,1],[7,1,8,1],[7,2,8,2],[7,4,8,4],[9,1,11,1],[13,1,15,1],[19,1,21,1],[23,1,25,1],[7,3,8,3],[7,5,8,5],[7,6,8,6],[7,7,8,7],[7,8,8,8],[7,9,8,9]]}
[]
[]
[]
[null,"Anforderungsprofil zur Position:",null,null,"wissenschaftliche Mitarbeiterin"]
[]
[null,null,"vom (Datum):",null,"2017-12-12"]
[]
[null,null,"Kompetenz","geringe Ausprägung der Kompetenz","Beispielhafte Verhaltensmerkmale","Selbstbeurteilung","Summe Fremdbeurteilung","Anzahl \nFremdbeurtei-lungen","Durchschnitt \nFremdbeurteilungen","Schwellenwert"]
[null,null,null,null,null,"S"]
[null,"Persönliche Kompetenzen",{"$f":"IF(ROW(C1)>COUNTIF('1. Katalog Kompetenzen I'!G:G,TRUE),\"\",INDEX('1. Katalog Kompetenzen I'!D:D,SMALL(IF('1. Katalog Kompetenzen I'!G:G=TRUE,ROW($1:$112)),ROW(C1))))","v":""},{"$f":"IF(ROW(D1)>COUNTIF('1. Katalog Kompetenzen I'!$G:$G,TRUE),\"\",INDEX('1. Katalog Kompetenzen I'!E:E,SMALL(IF('1. Katalog Kompetenzen I'!$G:$G=TRUE,ROW($1:$112)),ROW(D1))))","v":""},{"$f":"IF(ROW(E1)>COUNTIF('1. Katalog Kompetenzen I'!$G:$G,TRUE),\"\",INDEX('1. Katalog Kompetenzen I'!F:F,SMALL(IF('1. Katalog Kompetenzen I'!$G:$G=TRUE,ROW($1:$112)),ROW(E1))))","v":""},{"$f":"'3. Selbstbeurteilung'!G11","v":0},{"$f":"('4. Fremdbeurteilung I'!G13+'4. Fremdbeurteilung II'!G13+'4. Fremdbeurteilung III'!G13+'4. Fremdbeurteilung IV'!G13)","v":0},{"$f":"(IF('4. Fremdbeurteilung I'!$E$7>0,1,0))+(IF('4. Fremdbeurteilung II'!$E$7>0,1,0))+(IF('4. Fremdbeurteilung III'!$E$7>0,1,0))+(IF('4. Fremdbeurteilung IV'!$E$7>0,1,0))","v":0},{"$f":"G10/H10","v":{"$error":"#DIV/0!"}},{"$f":"'2. Anforderungsprofil'!G11","v":0}]
{"$rows_left_out":26}
{"sheet":"6. Maßnahmenübersicht","index":16,"n_rows":22,"n_cols":8,"rows_kept":22,"cut":false,"hidden":false,"merged":[[10,7,11,7],[1,1,1,6],[10,4,10,6],[10,1,11,1],[10,2,11,2],[10,3,11,3],[6,5,6,6],[6,1,6,4],[8,1,8,4],[8,5,8,6]]}
[]
[null,"6. Maßnahmenübersicht"]
[null,null,null,null,null,null,null,"hoch "]
[null,null,null,null,null,null,null,"mittel "]
[null,null,null,null,null,null,null,"gering"]
[]
[null,"Vereinbarungen zur weiteren Entwicklung von:",null,null,null,{"$f":"'3. Selbstbeurteilung'!E5","v":0}]
[]
[null,"vom (Datum):"]
[]
{"$rows_left_out":12}